Reaction Details
TargetMelanin-concentrating hormone receptor 1
LigandBDBM50193605
Substrate/Competitorn/a
Meas. Tech.ChEMBL_421232 (CHEMBL856554)
EC50 90±n/a nM
Citation Jiang, JLin, PHoang, MChang, LTan, CFeighner, SPalyha, OCHreniuk, DLPan, JSailer, AWMorin, NRMacNeil, DJHoward, ADVan der Ploeg, LHGoulet, MTDeVita, RJ 4-Aminoquinoline melanin-concentrating hormone 1-receptor (MCH1R) antagonists. Bioorg Med Chem Lett16:5275-9 (2006) 
 
Melanin-concentrating hormone receptor 1
Name:Melanin-concentrating hormone receptor 1
Type:G Protein-Coupled Receptor (GPCR)
Mol. Mass.:45976.27
Organism:Homo sapiens (Human)
Description:Membranes from CHO-K1 cells stably expressing human MCH1R were used in assays.
Residue:422
BDBM50193605
NameBDBM50193605
Synonyms:(E)-N-(4-amino-2-pentylquinolin-6-yl)-3-(4-(trifluoromethyl)phenyl)acrylamide | CHEMBL216428
TypeSmall organic molecule
Emp. Form.C24H24F3N3O
Mol. Mass.427.4621
SMILESCCCCCc1cc(N)c2cc(NC(=O)\C=C\c3ccc(cc3)C(F)(F)F)ccc2n1