Reaction Details
TargetSodium-dependent noradrenaline transporter
LigandBDBM50193775
Substrate/Competitorn/a
Meas. Tech.ChEMBL_424087 (CHEMBL855090)
Ki 497±n/a nM
Citation Watson, PSJiang, BHarrison, KAsakawa, NWelch, PKCovington, MStowell, NCWadman, EADavies, PSolomon, KANewton, RCTrainor, GLFriedman, SMDecicco, CPKo, SS 2,4-Disubstituted piperidines as selective CC chemokine receptor 3 (CCR3) antagonists: synthesis and selectivity. Bioorg Med Chem Lett16:5695-9 (2006) 
 
Sodium-dependent noradrenaline transporter
Name:Sodium-dependent noradrenaline transporter
Type:Multi-pass membrane protein
Mol. Mass.:69337.72
Organism:Homo sapiens (Human)
Description:P23975
Residue:617
BDBM50193775
NameBDBM50193775
Synonyms:1-(3-((2S,4R)-4-(4-fluorobenzyl)-1-(3-hydroxypropyl)piperidin-2-yl)propyl)-3-(3,5-diacetylphenyl)urea | CHEMBL384199
TypeSmall organic molecule
Emp. Form.C29H38FN3O4
Mol. Mass.511.6281
SMILESCC(=O)c1cc(NC(=O)NCCC[C@H]2C[C@H](Cc3ccc(F)cc3)CCN2CCCO)cc(c1)C(C)=O