Reaction Details
TargetSodium-dependent serotonin transporter
LigandBDBM50193764
Substrate/Competitorn/a
Meas. Tech.ChEMBL_424085 (CHEMBL855088)
Ki 19±n/a nM
Citation Watson, PSJiang, BHarrison, KAsakawa, NWelch, PKCovington, MStowell, NCWadman, EADavies, PSolomon, KANewton, RCTrainor, GLFriedman, SMDecicco, CPKo, SS 2,4-Disubstituted piperidines as selective CC chemokine receptor 3 (CCR3) antagonists: synthesis and selectivity. Bioorg Med Chem Lett16:5695-9 (2006) 
 
Sodium-dependent serotonin transporter
Name:Sodium-dependent serotonin transporter
Type:Multi-pass membrane protein
Mol. Mass.:70322.51
Organism:Homo sapiens (Human)
Description:P31645
Residue:630
BDBM50193764
NameBDBM50193764
Synonyms:(2S,4R)-2-{3-[3-(3,5-diacetyl-phenyl)-ureido]-propyl}-4-(4-fluoro-benzyl)-piperidine-1-carboxamidine | CHEMBL220766
TypeSmall organic molecule
Emp. Form.C27H34FN5O3
Mol. Mass.495.589
SMILESCC(=O)c1cc(NC(=O)NCCC[C@H]2C[C@H](Cc3ccc(F)cc3)CCN2C(N)=N)cc(c1)C(C)=O