Reaction Details
TargetC-C chemokine receptor type 3
LigandBDBM50193779
Substrate/Competitorn/a
Meas. Tech.ChEMBL_424084 (CHEMBL855087)
IC50 1.7±n/a nM
Citation Watson, PSJiang, BHarrison, KAsakawa, NWelch, PKCovington, MStowell, NCWadman, EADavies, PSolomon, KANewton, RCTrainor, GLFriedman, SMDecicco, CPKo, SS 2,4-Disubstituted piperidines as selective CC chemokine receptor 3 (CCR3) antagonists: synthesis and selectivity. Bioorg Med Chem Lett16:5695-9 (2006) 
 
C-C chemokine receptor type 3
Name:C-C chemokine receptor type 3
Type:Enzyme
Mol. Mass.:41053.88
Organism:Homo sapiens (Human)
Description:P51677
Residue:355
BDBM50193779
NameBDBM50193779
Synonyms:1-(3-((2S,4R)-4-(4-fluorobenzyl)-1-methylpiperidin-2-yl)propyl)-3-(3-acetylphenyl)urea | CHEMBL218174
TypeSmall organic molecule
Emp. Form.C25H32FN3O2
Mol. Mass.425.5389
SMILESCN1CC[C@@H](Cc2ccc(F)cc2)C[C@@H]1CCCNC(=O)Nc1cccc(c1)C(C)=O