Reaction Details
TargetSodium-dependent serotonin transporter
LigandBDBM50193759
Substrate/Competitorn/a
Meas. Tech.ChEMBL_424085 (CHEMBL855088)
Ki 69±n/a nM
Citation Watson, PSJiang, BHarrison, KAsakawa, NWelch, PKCovington, MStowell, NCWadman, EADavies, PSolomon, KANewton, RCTrainor, GLFriedman, SMDecicco, CPKo, SS 2,4-Disubstituted piperidines as selective CC chemokine receptor 3 (CCR3) antagonists: synthesis and selectivity. Bioorg Med Chem Lett16:5695-9 (2006) 
 
Sodium-dependent serotonin transporter
Name:Sodium-dependent serotonin transporter
Type:Multi-pass membrane protein
Mol. Mass.:70322.51
Organism:Homo sapiens (Human)
Description:P31645
Residue:630
BDBM50193759
NameBDBM50193759
Synonyms:1-(3-((2S,4R)-4-(4-fluorobenzyl)-1-allylpiperidin-2-yl)propyl)-3-(3,5-diacetylphenyl)urea | CHEMBL218262
TypeSmall organic molecule
Emp. Form.C29H36FN3O3
Mol. Mass.493.6128
SMILESCC(=O)c1cc(NC(=O)NCCC[C@H]2C[C@H](Cc3ccc(F)cc3)CCN2CC=C)cc(c1)C(C)=O