Reaction Details
TargetKappa-type opioid receptor
LigandBDBM50194399
Substrate/Competitorn/a
Meas. Tech.ChEMBL_424357 (CHEMBL909560)
Ki>1000±n/a nM
Citation Lee, DYHe, MLiu-Chen, LYWang, YLi, JGXu, WMa, ZCarlezon, WACohen, B Synthesis and in vitro pharmacological studies of new C(4)-modified salvinorin A analogues. Bioorg Med Chem Lett16:5498-502 (2006) 
 
Kappa-type opioid receptor
Name:Kappa-type opioid receptor
Type:G Protein-Coupled Receptor (GPCR)
Mol. Mass.:42648.76
Organism:Homo sapiens (Human)
Description:P41145
Residue:380
BDBM50194399
NameBDBM50194399
Synonyms:(2S,4aR,6aS,7R,9S,10aS,10bR)-7-(allyloxymethyl)-2-(furan-3-yl)-6a,10b-dimethyl-4,10-dioxo-dodecahydro-1H-benzo[f]isochromen-9-yl acetate | CHEMBL376212
TypeSmall organic molecule
Emp. Form.C25H32O7
Mol. Mass.444.5174
SMILESCC(=O)O[C@H]1C[C@@H](COCC=C)[C@]2(C)CC[C@H]3C(=O)O[C@@H](C[C@]3(C)[C@H]2C1=O)c1ccoc1