Reaction Details
TargetCholinesterase
LigandBDBM50004000
Substrate/Competitorn/a
Meas. Tech.ChEMBL_424372 (CHEMBL911303)
IC50 1200±n/a nM
Citation Schott, YDecker, MRommelspacher, HLehmann, J 6-Hydroxy- and 6-methoxy-beta-carbolines as acetyl- and butyrylcholinesterase inhibitors. Bioorg Med Chem Lett16:5840-3 (2006) 
 
Cholinesterase
Name:Cholinesterase
Type:Homotetramer
Mol. Mass.:68422.27
Organism:Homo sapiens (Human)
Description:P06276
Residue:602
BDBM50004000
NameBDBM50004000
Synonyms:(3aS,8aR)-1,3a,8-trimethyl-1,2,3,3a,8,8a-hexahydropyrrolo[2,3-b]indol-5-yl methylcarbamate CHEMBL94 Physostol | physostigmine
TypeSmall organic molecule
Emp. Form.C15H21N3O2
Mol. Mass.275.3461
SMILESCNC(=O)Oc1ccc2N(C)[C@H]3N(C)CC[C@@]3(C)c2c1