Reaction Details
Target5-hydroxytryptamine receptor 6
LigandBDBM30707
Substrate/Competitorn/a
Meas. Tech.ChEMBL_424391 (CHEMBL911322)
Ki 13±n/a nM
Citation Kolanos, RDukat, MRoth, BLGlennon, RA Interaction of N1-unsubstituted and N1-benzenesulfonyltryptamines at h5-HT6 receptors. Bioorg Med Chem Lett16:5832-5 (2006) 
 
5-hydroxytryptamine receptor 6
Name:5-hydroxytryptamine receptor 6
Type:G Protein-Coupled Receptor (GPCR)
Mol. Mass.:46968.43
Organism:Homo sapiens (Human)
Description:P50406
Residue:440
BDBM30707
NameBDBM30707
Synonyms:2-(5-methoxy-1H-indol-3-yl)-N,N-dimethyl-ethanamine 2-(5-methoxy-1H-indol-3-yl)ethyl-dimethyl-amine CHEMBL7257 Methoxydimethyltryptamines WO2023019367, Compound 5-MeO-DMT | cid_1832
TypeSmall organic molecule
Emp. Form.C13H18N2O
Mol. Mass.218.2948
SMILESCOc1ccc2[nH]cc(CCN(C)C)c2c1