Reaction Details
TargetALK tyrosine kinase receptor/Nucleophosmin
LigandBDBM4552
Substrate/Competitorn/a
Meas. Tech.ChEMBL_400208 (CHEMBL911510)
IC50 200±n/a nM
Citation Gunby, RHAhmed, SSottocornola, RGasser, MRedaelli, SMologni, LTartari, CJBelloni, VGambacorti-Passerini, CScapozza, L Structural insights into the ATP binding pocket of the anaplastic lymphoma kinase by site-directed mutagenesis, inhibitor binding analysis, and homology modeling. J Med Chem49:5759-68 (2006) 
 
ALK tyrosine kinase receptor/Nucleophosmin
Name:ALK tyrosine kinase receptor/Nucleophosmin
Synonyms:NPM/ALK (Nucleophosmin/ALK tyrosine kinase receptor)
Type:n/a
Mol. Mass.:n/a
Description:ASSAY_ID of EBI is 331455
Components:This complex has 2 components.
Component 1
Name:ALK tyrosine kinase receptor
Type:Protein
Mol. Mass.:176453.10
Organism:Homo sapiens (Human)
Description:Q9UM73
Residue:1620
Component 2
Name:Nucleophosmin
Synonyms:NPM NPM1 | NPM_HUMAN
Type:PROTEIN
Mol. Mass.:32552.99
Organism:Homo sapiens (Human)
Description:ChEMBL_1502715
Residue:294
Component 3
Name:ALK tyrosine kinase receptor
Synonyms:ALK ALK_HUMAN CD_antigen: CD246
Type:Protein
Mol. Mass.:176453.10
Organism:Homo sapiens (Human)
Description:Q9UM73
Residue:1620
BDBM4552
NameBDBM4552
Synonyms:4-[(2,4-Dichloro-5-methoxyphenyl)amino]-6-methoxy-7-[3-(4-methyl-1-piperazinyl)propoxy]-3-quinolinecarbonitrile BOSUTINIB SKI-606
TypeSmall organic molecule
Emp. Form.C26H29Cl2N5O3
Mol. Mass.530.446
SMILESCOc1cc(Nc2c(cnc3cc(OCCCN4CCN(C)CC4)c(OC)cc23)C#N)c(Cl)cc1Cl