Reaction Details
TargetPeroxisome proliferator-activated receptor gamma
LigandBDBM50194963
Substrate/Competitorn/a
Meas. Tech.ChEMBL_424612 (CHEMBL853963)
Ki 63±n/a nM
Citation Humphries, PSBailey, SAlmaden, JVBarnum, SJCarlson, TJChristie, LCDo, QQFraser, JDHess, MKellum, JKim, YHMcClellan, GAOgilvie, KMSimmons, BHSkalitzky, DSun, SWilhite, DZehnder, LR Pyridine-3-propanoic acids: Discovery of dual PPARalpha/gamma agonists as antidiabetic agents. Bioorg Med Chem Lett16:6120-3 (2006) 
 
Peroxisome proliferator-activated receptor gamma
Name:Peroxisome proliferator-activated receptor gamma
Type:Nuclear Receptor
Mol. Mass.:57613.46
Organism:Homo sapiens (Human)
Description:P37231
Residue:505
BDBM50194963
NameBDBM50194963
Synonyms:2-methoxy-3-(6-(2-(5-methyl-2-phenyloxazol-4-yl)ethoxy)pyridin-3-yl)propanoic acid | CHEMBL373874
TypeSmall organic molecule
Emp. Form.C21H22N2O5
Mol. Mass.382.4098
SMILESCOC(Cc1ccc(OCCc2nc(oc2C)-c2ccccc2)nc1)C(O)=O