Reaction Details
TargetPeroxisome proliferator-activated receptor alpha
LigandBDBM50195075
Substrate/Competitorn/a
Meas. Tech.ChEMBL_424737 (CHEMBL907889)
Ki 840±n/a nM
Citation Humphries, PSAlmaden, JVBarnum, SJCarlson, TJDo, QQFraser, JDHess, MKim, YHOgilvie, KMSun, S Pyridine-2-propanoic acids: Discovery of dual PPARalpha/gamma agonists as antidiabetic agents. Bioorg Med Chem Lett16:6116-9 (2006) 
 
Peroxisome proliferator-activated receptor alpha
Name:Peroxisome proliferator-activated receptor alpha
Type:Enzyme
Mol. Mass.:52222.08
Organism:Homo sapiens (Human)
Description:Q07869
Residue:468
BDBM50195075
NameBDBM50195075
Synonyms:2-ethoxy-3-(5-(3-(5-methyl-2-phenyloxazol-4-yl)propoxy)pyridin-2-yl)propanoic acid | CHEMBL221529
TypeSmall organic molecule
Emp. Form.C23H26N2O5
Mol. Mass.410.4629
SMILESCCOC(Cc1ccc(OCCCc2nc(oc2C)-c2ccccc2)cn1)C(O)=O