Reaction Details
TargetPeroxisome proliferator-activated receptor alpha
LigandBDBM50195082
Substrate/Competitorn/a
Meas. Tech.ChEMBL_424737 (CHEMBL907889)
Ki 840±n/a nM
Citation Humphries, PSAlmaden, JVBarnum, SJCarlson, TJDo, QQFraser, JDHess, MKim, YHOgilvie, KMSun, S Pyridine-2-propanoic acids: Discovery of dual PPARalpha/gamma agonists as antidiabetic agents. Bioorg Med Chem Lett16:6116-9 (2006) 
 
Peroxisome proliferator-activated receptor alpha
Name:Peroxisome proliferator-activated receptor alpha
Type:Enzyme
Mol. Mass.:52222.08
Organism:Homo sapiens (Human)
Description:Q07869
Residue:468
BDBM50195082
NameBDBM50195082
Synonyms:2-((5-(2-(2-(4-methoxyphenyl)-5-methyloxazol-4-yl)ethoxy)pyridin-2-yl)methyl)-tetrahydrofuran-2-carboxylic acid | CHEMBL221388
TypeSmall organic molecule
Emp. Form.C24H26N2O6
Mol. Mass.438.473
SMILESCOc1ccc(cc1)-c1nc(CCOc2ccc(CC3(CCCO3)C(O)=O)nc2)c(C)o1