Reaction Details
TargetPeroxisome proliferator-activated receptor gamma
LigandBDBM50195077
Substrate/Competitorn/a
Meas. Tech.ChEMBL_424736 (CHEMBL907888)
Ki 1600±n/a nM
Citation Humphries, PSAlmaden, JVBarnum, SJCarlson, TJDo, QQFraser, JDHess, MKim, YHOgilvie, KMSun, S Pyridine-2-propanoic acids: Discovery of dual PPARalpha/gamma agonists as antidiabetic agents. Bioorg Med Chem Lett16:6116-9 (2006) 
 
Peroxisome proliferator-activated receptor gamma
Name:Peroxisome proliferator-activated receptor gamma
Type:Nuclear Receptor
Mol. Mass.:57613.46
Organism:Homo sapiens (Human)
Description:P37231
Residue:505
BDBM50195077
NameBDBM50195077
Synonyms:2-methoxy-2-methyl-3-(5-(2-(5-methyl-2-phenyloxazol-4-yl)ethoxy)pyridin-2-yl)propanoic acid | CHEMBL222121
TypeSmall organic molecule
Emp. Form.C22H24N2O5
Mol. Mass.396.4364
SMILESCOC(C)(Cc1ccc(OCCc2nc(oc2C)-c2ccccc2)cn1)C(O)=O