Reaction Details
Target11-beta-hydroxysteroid dehydrogenase 1
LigandBDBM50195301
Substrate/Competitorn/a
Meas. Tech.ChEMBL_424846 (CHEMBL907396)
Ki 6±n/a nM
Citation Sorensen, BRohde, JWang, JFung, SMonzon, KChiou, WPan, LDeng, XStolarik, DFrevert, EUJacobson, PLink, JT Adamantane 11-beta-HSD-1 inhibitors: Application of an isocyanide multicomponent reaction. Bioorg Med Chem Lett16:5958-62 (2006) 
 
11-beta-hydroxysteroid dehydrogenase 1
Name:11-beta-hydroxysteroid dehydrogenase 1
Type:Enzyme
Mol. Mass.:32409.16
Organism:Homo sapiens (Human)
Description:P28845
Residue:292
BDBM50195301
NameBDBM50195301
Synonyms:4-{2-cyclopropyl-2-[4-(5-trifluoromethyl-pyridin-2-yl)-piperazin-1-yl]-acetylamino}-adamantane-1-carboxylic acid amide | CHEMBL222618
TypeSmall organic molecule
Emp. Form.C26H34F3N5O2
Mol. Mass.505.5757
SMILESNC(=O)[C@@]12CC3CC(C1)[C@H](NC(=O)C(C1CC1)N1CCN(CC1)c1ccc(cn1)C(F)(F)F)C(C3)C2