Reaction Details
Target11-beta-hydroxysteroid dehydrogenase 1
LigandBDBM50195304
Substrate/Competitorn/a
Meas. Tech.ChEMBL_424847 (CHEMBL907397)
Ki 4±n/a nM
Citation Sorensen, BRohde, JWang, JFung, SMonzon, KChiou, WPan, LDeng, XStolarik, DFrevert, EUJacobson, PLink, JT Adamantane 11-beta-HSD-1 inhibitors: Application of an isocyanide multicomponent reaction. Bioorg Med Chem Lett16:5958-62 (2006) 
 
11-beta-hydroxysteroid dehydrogenase 1
Name:11-beta-hydroxysteroid dehydrogenase 1
Type:Enzyme
Mol. Mass.:32369.70
Organism:Mus musculus (mouse)
Description:P50172
Residue:292
BDBM50195304
NameBDBM50195304
Synonyms:CHEMBL220282 | N-(5-hydroxy-adamantan-2-yl)-2-piperidin-1-yl-isobutyramide
TypeSmall organic molecule
Emp. Form.C19H32N2O2
Mol. Mass.320.4696
SMILESCC(C)(N1CCCCC1)C(=O)N[C@H]1C2C[C@H]3CC1C[C@](O)(C3)C2