Reaction Details
Target11-beta-hydroxysteroid dehydrogenase 1
LigandBDBM50195481
Substrate/Competitorn/a
Meas. Tech.ChEMBL_425007 (CHEMBL911427)
IC50 900±n/a nM
Citation Richards, SSorensen, BJae, HSWinn, MChen, YWang, JFung, SMonzon, KFrevert, EUJacobson, PSham, HLink, JT Discovery of potent and selective inhibitors of 11beta-HSD1 for the treatment of metabolic syndrome. Bioorg Med Chem Lett16:6241-5 (2006) 
 
11-beta-hydroxysteroid dehydrogenase 1
Name:11-beta-hydroxysteroid dehydrogenase 1
Type:Enzyme
Mol. Mass.:32409.16
Organism:Homo sapiens (Human)
Description:P28845
Residue:292
BDBM50195481
NameBDBM50195481
Synonyms:(1s,4s)-ethyl 4-(4-amino-3,5-dichloro-N-cyclopropylbenzamido)cyclohexanecarboxylate | CHEMBL376256
TypeSmall organic molecule
Emp. Form.C19H24Cl2N2O3
Mol. Mass.399.311
SMILESCCOC(=O)[C@@H]1CC[C@@H](CC1)N(C1CC1)C(=O)c1cc(Cl)c(N)c(Cl)c1