Reaction Details
Target11-beta-hydroxysteroid dehydrogenase 1
LigandBDBM50195494
Substrate/Competitorn/a
Meas. Tech.ChEMBL_425005 (CHEMBL912530)
Ki 210±n/a nM
Citation Richards, SSorensen, BJae, HSWinn, MChen, YWang, JFung, SMonzon, KFrevert, EUJacobson, PSham, HLink, JT Discovery of potent and selective inhibitors of 11beta-HSD1 for the treatment of metabolic syndrome. Bioorg Med Chem Lett16:6241-5 (2006) 
 
11-beta-hydroxysteroid dehydrogenase 1
Name:11-beta-hydroxysteroid dehydrogenase 1
Type:Enzyme
Mol. Mass.:31889.48
Organism:Rattus norvegicus (rat)
Description:P16232
Residue:288
BDBM50195494
NameBDBM50195494
Synonyms:(4-amino-3,5-dichlorophenyl)(5-benzyl-1,5-diazocan-1-yl)methanone | CHEMBL220436
TypeSmall organic molecule
Emp. Form.C20H23Cl2N3O
Mol. Mass.392.322
SMILESNc1c(Cl)cc(cc1Cl)C(=O)N1CCCN(Cc2ccccc2)CCC1