Reaction Details
Target11-beta-hydroxysteroid dehydrogenase type 2
LigandBDBM50195481
Substrate/Competitorn/a
Meas. Tech.ChEMBL_425008 (CHEMBL911428)
IC50>10000±n/a nM
Citation Richards, SSorensen, BJae, HSWinn, MChen, YWang, JFung, SMonzon, KFrevert, EUJacobson, PSham, HLink, JT Discovery of potent and selective inhibitors of 11beta-HSD1 for the treatment of metabolic syndrome. Bioorg Med Chem Lett16:6241-5 (2006) 
 
11-beta-hydroxysteroid dehydrogenase type 2
Name:11-beta-hydroxysteroid dehydrogenase type 2
Type:PROTEIN
Mol. Mass.:43740.05
Organism:Rattus norvegicus
Description:ChEMBL_735659
Residue:400
BDBM50195481
NameBDBM50195481
Synonyms:(1s,4s)-ethyl 4-(4-amino-3,5-dichloro-N-cyclopropylbenzamido)cyclohexanecarboxylate | CHEMBL376256
TypeSmall organic molecule
Emp. Form.C19H24Cl2N2O3
Mol. Mass.399.311
SMILESCCOC(=O)[C@@H]1CC[C@@H](CC1)N(C1CC1)C(=O)c1cc(Cl)c(N)c(Cl)c1