Reaction Details
TargetHistone deacetylase 2b
LigandBDBM50195616
Substrate/Competitorn/a
Meas. Tech.ChEMBL_416717 (CHEMBL909983)
IC50 38±n/a nM
Citation Mai, AMassa, SRotili, DSimeoni, SRagno, RBotta, GNebbioso, AMiceli, MAltucci, LBrosch, G Synthesis and biological properties of novel, uracil-containing histone deacetylase inhibitors. J Med Chem49:6046-56 (2006) 
 
Histone deacetylase 2b
Name:Histone deacetylase 2b
Synonyms:Histone deacetylase HD2
Type:PROTEIN
Mol. Mass.:30785.07
Organism:Zea mays
Description:ChEMBL_87549
Residue:286
BDBM50195616
NameBDBM50195616
TypeSmall organic molecule
Emp. Form.C17H21N3O3S
Mol. Mass.347.432
SMILESONC(=O)CCCCCCSc1nc(cc(=O)[nH]1)-c1ccccc1