Reaction Details
TargetHistone deacetylase
LigandBDBM50195618
Substrate/Competitorn/a
Meas. Tech.ChEMBL_416719 (CHEMBL909985)
IC50 79±n/a nM
Citation Mai, AMassa, SRotili, DSimeoni, SRagno, RBotta, GNebbioso, AMiceli, MAltucci, LBrosch, G Synthesis and biological properties of novel, uracil-containing histone deacetylase inhibitors. J Med Chem49:6046-56 (2006) 
 
Histone deacetylase
Name:Histone deacetylase
Synonyms:Histone deacetylase HD1B
Type:PROTEIN
Mol. Mass.:50930.01
Organism:Zea mays
Description:ChEMBL_422128
Residue:458
BDBM50195618
NameBDBM50195618
TypeSmall organic molecule
Emp. Form.C18H23N3O4S
Mol. Mass.377.458
SMILESCOC(c1ccccc1)c1cc(=O)[nH]c(SCCCCCC(=O)NO)n1