Reaction Details
TargetHistone deacetylase 1
LigandBDBM50195605
Substrate/Competitorn/a
Meas. Tech.ChEMBL_416725 (CHEMBL908971)
IC50 57±n/a nM
Citation Mai, AMassa, SRotili, DSimeoni, SRagno, RBotta, GNebbioso, AMiceli, MAltucci, LBrosch, G Synthesis and biological properties of novel, uracil-containing histone deacetylase inhibitors. J Med Chem49:6046-56 (2006) 
 
Histone deacetylase 1
Name:Histone deacetylase 1
Type:Protein
Mol. Mass.:55062.26
Organism:Mus musculus (Mouse)
Description:O09106
Residue:482
BDBM50195605
NameBDBM50195605
Synonyms:CHEMBL214533 | N-hydroxy-3-(3,4-dihydro-6-phenyl-4-oxopyrimidin-2-ylthio)methylcinnamylamide
TypeSmall organic molecule
Emp. Form.C20H17N3O3S
Mol. Mass.379.432
SMILESONC(=O)C=Cc1cccc(CSc2nc(cc(=O)[nH]2)-c2ccccc2)c1