Reaction Details
TargetD(1A) dopamine receptor
LigandBDBM50196234
Substrate/Competitorn/a
Meas. Tech.ChEMBL_417939 (CHEMBL908356)
Ki 2.2±n/a nM
Citation Enzensperger, CLehmann, J Dopamine/serotonin receptor ligands. 13: Homologization of a benzindoloazecine-type dopamine receptor antagonist modulates the affinities for dopamine D(1)-D(5) receptors. J Med Chem49:6408-11 (2006) 
 
D(1A) dopamine receptor
Name:D(1A) dopamine receptor
Type:Enzyme
Mol. Mass.:49303.43
Organism:Homo sapiens (Human)
Description:P21728
Residue:446
BDBM50196234
NameBDBM50196234
Synonyms:8-methyl-5,6,7,8,9,10,15,16-octahydroindolo[3,2-g][4]benzazacycloundecine | CHEMBL216258
TypeSmall organic molecule
Emp. Form.C21H24N2
Mol. Mass.304.4287
SMILESCN1CCCc2ccccc2Cc2[nH]c3ccccc3c2CC1