Reaction Details
TargetHistone deacetylase 1
LigandBDBM50196598
Substrate/Competitorn/a
Meas. Tech.ChEMBL_422105 (CHEMBL907102)
IC50 6.2±n/a nM
Citation Marson, CMMahadevan, TDines, JSengmany, SMorrell, JMAlao, JPJoel, SPVigushin, DMCharles Coombes, R Structure-activity relationships of aryloxyalkanoic acid hydroxyamides as potent inhibitors of histone deacetylase. Bioorg Med Chem Lett17:136-41 (2006) 
 
Histone deacetylase 1
Name:Histone deacetylase 1
Type:Enzyme
Mol. Mass.:55090.27
Organism:Homo sapiens (Human)
Description:Q13547
Residue:482
BDBM50196598
NameBDBM50196598
Synonyms:7-(4-(3-(1H-indol-3-yl)prop-1-en-2-ylamino)phenyl1H-indol-3-yl)prop-1-en-2-ylamino)phenoxy)-N-hydroxyheptanamide | CHEMBL216181
TypeSmall organic molecule
Emp. Form.C24H29N3O3
Mol. Mass.407.5054
SMILESCC(Cc1c[nH]c2ccccc12)=Nc1ccc(OCCCCCCC(=O)NO)cc1