Reaction Details
TargetMetabotropic glutamate receptor 1
LigandBDBM50197251
Substrate/Competitorn/a
Meas. Tech.ChEMBL_453190 (CHEMBL902340)
Ki 30±n/a nM
Citation Owen, DRDodd, PGGayton, SGreener, BSHarbottle, GWMantell, SJMaw, GNOsborne, SARees, HRinger, TJRodriguez-Lens, MSmith, GF Structure-activity relationships of novel non-competitive mGluR1 antagonists: a potential treatment for chronic pain. Bioorg Med Chem Lett17:486-90 (2007) 
 
Metabotropic glutamate receptor 1
Name:Metabotropic glutamate receptor 1
Type:Enzyme Catalytic Domain
Mol. Mass.:133240.47
Organism:RAT
Description:metabotropic glutamate 1/2 0 RAT::P23385
Residue:1199
BDBM50197251
NameBDBM50197251
Synonyms:6-(butyl(methyl)amino)-N-cycloheptylpyrazine-2-carboxamide | CHEMBL397640
TypeSmall organic molecule
Emp. Form.C17H28N4O
Mol. Mass.304.4304
SMILESCCCCN(C)c1cncc(n1)C(=O)NC1CCCCCC1