Reaction Details
TargetMetabotropic glutamate receptor 1
LigandBDBM50197264
Substrate/Competitorn/a
Meas. Tech.ChEMBL_453190 (CHEMBL902340)
Ki 35±n/a nM
Citation Owen, DRDodd, PGGayton, SGreener, BSHarbottle, GWMantell, SJMaw, GNOsborne, SARees, HRinger, TJRodriguez-Lens, MSmith, GF Structure-activity relationships of novel non-competitive mGluR1 antagonists: a potential treatment for chronic pain. Bioorg Med Chem Lett17:486-90 (2007) 
 
Metabotropic glutamate receptor 1
Name:Metabotropic glutamate receptor 1
Type:Enzyme Catalytic Domain
Mol. Mass.:133240.47
Organism:RAT
Description:metabotropic glutamate 1/2 0 RAT::P23385
Residue:1199
BDBM50197264
NameBDBM50197264
Synonyms:5-(4-(hydroxymethyl)piperidin-1-yl)-N-(2-methyl-2-phenylpropyl)pyrazine-2-carboxamide | CHEMBL246456
TypeSmall organic molecule
Emp. Form.C21H28N4O2
Mol. Mass.368.4726
SMILESCC(C)(CNC(=O)c1cnc(cn1)N1CCC(CO)CC1)c1ccccc1