Reaction Details
TargetMetabotropic glutamate receptor 1
LigandBDBM50197267
Substrate/Competitorn/a
Meas. Tech.ChEMBL_453190 (CHEMBL902340)
Ki 43±n/a nM
Citation Owen, DRDodd, PGGayton, SGreener, BSHarbottle, GWMantell, SJMaw, GNOsborne, SARees, HRinger, TJRodriguez-Lens, MSmith, GF Structure-activity relationships of novel non-competitive mGluR1 antagonists: a potential treatment for chronic pain. Bioorg Med Chem Lett17:486-90 (2007) 
 
Metabotropic glutamate receptor 1
Name:Metabotropic glutamate receptor 1
Type:Enzyme Catalytic Domain
Mol. Mass.:133240.47
Organism:RAT
Description:metabotropic glutamate 1/2 0 RAT::P23385
Residue:1199
BDBM50197267
NameBDBM50197267
Synonyms:6-((2-hydroxyethyl)(methyl)amino)-N-(2-methyl-2-phenylpropyl)pyrazine-2-carboxamide | CHEMBL247487
TypeSmall organic molecule
Emp. Form.C18H24N4O2
Mol. Mass.328.4088
SMILESCN(CCO)c1cncc(n1)C(=O)NCC(C)(C)c1ccccc1