Reaction Details
TargetC-X-C chemokine receptor type 3
LigandBDBM50198394
Substrate/Competitorn/a
Meas. Tech.ChEMBL_437683 (CHEMBL905958)
Ki 110±n/a nM
Citation Allen, DRBolt, AChapman, GAKnight, RLMeissner, JWOwen, DAWatson, RJ Identification and structure-activity relationships of 1-aryl-3-piperidin-4-yl-urea derivatives as CXCR3 receptor antagonists. Bioorg Med Chem Lett17:697-701 (2007) 
 
C-X-C chemokine receptor type 3
Name:C-X-C chemokine receptor type 3
Type:Enzyme Catalytic Domain
Mol. Mass.:40665.65
Organism:Homo sapiens (Human)
Description:n/a
Residue:368
BDBM50198394
NameBDBM50198394
Synonyms:(E)-1-(1-(cyclooctenylmethyl)piperidin-4-yl)-3-(naphthalen-2-yl)urea CHEMBL244610
TypeSmall organic molecule
Emp. Form.C25H33N3O
Mol. Mass.391.549
SMILESO=C(NC1CCN(C\C2=C\CCCCCC2)CC1)Nc1ccc2ccccc2c1