Reaction Details
TargetC-X-C chemokine receptor type 3
LigandBDBM50198403
Substrate/Competitorn/a
Meas. Tech.ChEMBL_437683 (CHEMBL905958)
Ki 660±n/a nM
Citation Allen, DRBolt, AChapman, GAKnight, RLMeissner, JWOwen, DAWatson, RJ Identification and structure-activity relationships of 1-aryl-3-piperidin-4-yl-urea derivatives as CXCR3 receptor antagonists. Bioorg Med Chem Lett17:697-701 (2007) 
 
C-X-C chemokine receptor type 3
Name:C-X-C chemokine receptor type 3
Type:Enzyme Catalytic Domain
Mol. Mass.:40665.65
Organism:Homo sapiens (Human)
Description:n/a
Residue:368
BDBM50198403
NameBDBM50198403
Synonyms:CHEMBL242267 | methyl 3-(3-(1-(cyclooctenylmethyl)piperidin-4-yl)ureido)benzoate
TypeSmall organic molecule
Emp. Form.C23H33N3O3
Mol. Mass.399.5264
SMILESCOC(=O)c1cccc(NC(=O)NC2CCN(C\C3=C\CCCCCC3)CC2)c1