Reaction Details
TargetC-X-C chemokine receptor type 3
LigandBDBM50198405
Substrate/Competitorn/a
Meas. Tech.ChEMBL_437683 (CHEMBL905958)
Ki 29±n/a nM
Citation Allen, DRBolt, AChapman, GAKnight, RLMeissner, JWOwen, DAWatson, RJ Identification and structure-activity relationships of 1-aryl-3-piperidin-4-yl-urea derivatives as CXCR3 receptor antagonists. Bioorg Med Chem Lett17:697-701 (2007) 
 
C-X-C chemokine receptor type 3
Name:C-X-C chemokine receptor type 3
Type:Enzyme Catalytic Domain
Mol. Mass.:40665.65
Organism:Homo sapiens (Human)
Description:n/a
Residue:368
BDBM50198405
NameBDBM50198405
Synonyms:1-(1-(((1R,5S)-6,6-dimethylbicyclo[3.1.1]hept-2-en-2-yl)methyl)piperidin-4-yl)-3-(5-(3-methoxyphenyl)thiophen-2-yl)urea | CHEMBL244399
TypeSmall organic molecule
Emp. Form.C27H35N3O2S
Mol. Mass.465.651
SMILESCOc1cccc(c1)-c1ccc(NC(=O)NC2CCN(CC3=CC[C@H]4C[C@@H]3C4(C)C)CC2)s1