Reaction Details
TargetC-X-C chemokine receptor type 3
LigandBDBM50198417
Substrate/Competitorn/a
Meas. Tech.ChEMBL_437683 (CHEMBL905958)
Ki 191±n/a nM
Citation Allen, DRBolt, AChapman, GAKnight, RLMeissner, JWOwen, DAWatson, RJ Identification and structure-activity relationships of 1-aryl-3-piperidin-4-yl-urea derivatives as CXCR3 receptor antagonists. Bioorg Med Chem Lett17:697-701 (2007) 
 
C-X-C chemokine receptor type 3
Name:C-X-C chemokine receptor type 3
Type:Enzyme Catalytic Domain
Mol. Mass.:40665.65
Organism:Homo sapiens (Human)
Description:n/a
Residue:368
BDBM50198417
NameBDBM50198417
Synonyms:1-(1-(((1R,5S)-6,6-dimethylbicyclo[3.1.1]hept-2-en-2-yl)methyl)piperidin-4-yl)-3-(5-phenylthiophen-2-yl)urea | CHEMBL394840
TypeSmall organic molecule
Emp. Form.C26H33N3OS
Mol. Mass.435.625
SMILESCC1(C)[C@@H]2C[C@H]1C(CN1CCC(CC1)NC(=O)Nc1ccc(s1)-c1ccccc1)=CC2