Reaction Details
TargetC-X-C chemokine receptor type 3
LigandBDBM50198420
Substrate/Competitorn/a
Meas. Tech.ChEMBL_437683 (CHEMBL905958)
Ki 306±n/a nM
Citation Allen, DRBolt, AChapman, GAKnight, RLMeissner, JWOwen, DAWatson, RJ Identification and structure-activity relationships of 1-aryl-3-piperidin-4-yl-urea derivatives as CXCR3 receptor antagonists. Bioorg Med Chem Lett17:697-701 (2007) 
 
C-X-C chemokine receptor type 3
Name:C-X-C chemokine receptor type 3
Type:Enzyme Catalytic Domain
Mol. Mass.:40665.65
Organism:Homo sapiens (Human)
Description:n/a
Residue:368
BDBM50198420
NameBDBM50198420
Synonyms:1-(1-(cyclooctenylmethyl)piperidin-4-yl)-3-(4-phenoxyphenyl)urea | CHEMBL245271
TypeSmall organic molecule
Emp. Form.C27H35N3O2
Mol. Mass.433.5857
SMILESO=C(NC1CCN(C\C2=C\CCCCCC2)CC1)Nc1ccc(Oc2ccccc2)cc1