Reaction Details
TargetAdenosine receptor A1
LigandBDBM50199271
Substrate/Competitorn/a
Meas. Tech.ChEMBL_412713 (CHEMBL908372)
Ki 46±n/a nM
Citation Kiesman, WFZhao, JConlon, PRDowling, JEPetter, RCLutterodt, FJin, XSmits, GFure, MJayaraj, AKim, JSullivan, GLinden, J Potent and orally bioavailable 8-bicyclo[2.2.2]octylxanthines as adenosine A1 receptor antagonists. J Med Chem49:7119-31 (2006) 
 
Adenosine receptor A1
Name:Adenosine receptor A1
Type:G Protein-Coupled Receptor (GPCR)
Mol. Mass.:36520.92
Organism:Homo sapiens (Human)
Description:P30542
Residue:326
BDBM50199271
NameBDBM50199271
Synonyms:4-(2,6-dioxo-1,3-dipropyl-2,3,6,7-tetrahydro-1H-purin-8-yl)-cyclohexanecarboxylic acid butylamide | CHEMBL217085
TypeSmall organic molecule
Emp. Form.C22H35N5O3
Mol. Mass.417.545
SMILESCCCCNC(=O)[C@H]1CC[C@@H](CC1)c1nc2c([nH]1)n(CCC)c(=O)n(CCC)c2=O