Reaction Details
TargetAdenosine receptor A2a
LigandBDBM50199285
Substrate/Competitorn/a
Meas. Tech.ChEMBL_412715 (CHEMBL908374)
Ki 912±n/a nM
Citation Kiesman, WFZhao, JConlon, PRDowling, JEPetter, RCLutterodt, FJin, XSmits, GFure, MJayaraj, AKim, JSullivan, GLinden, J Potent and orally bioavailable 8-bicyclo[2.2.2]octylxanthines as adenosine A1 receptor antagonists. J Med Chem49:7119-31 (2006) 
 
Adenosine receptor A2a
Name:Adenosine receptor A2a
Type:G Protein-Coupled Receptor (GPCR)
Mol. Mass.:44716.46
Organism:Homo sapiens (Human)
Description:P29274
Residue:412
BDBM50199285
NameBDBM50199285
Synonyms:4-(2,6-dioxo-1,3-dipropyl-2,3,6,7-tetrahydro-1H-purin-8-yl)-bicyclo[2.2.2]octane-1-carboxylic acid methyl ester | CHEMBL438823
TypeSmall organic molecule
Emp. Form.C21H30N4O4
Mol. Mass.402.4873
SMILESCCCn1c2nc([nH]c2c(=O)n(CCC)c1=O)[C@@]12CC[C@@](CC1)(CC2)C(=O)OC