Reaction Details
Target5-hydroxytryptamine receptor 1B
LigandBDBM50199564
Substrate/Competitorn/a
Meas. Tech.ChEMBL_432902 (CHEMBL915028)
Ki 51±n/a nM
Citation Horchler, CLMcCauley, JPHall, JESnyder, DHCraig Moore, WHudzik, TJChapdelaine, MJ Synthesis of novel quinolone and quinoline-2-carboxylic acid (4-morpholin-4-yl-phenyl)amides: a late-stage diversification approach to potent 5HT1B antagonists. Bioorg Med Chem15:939-50 (2006) 
 
5-hydroxytryptamine receptor 1B
Name:5-hydroxytryptamine receptor 1B
Type:G Protein-Coupled Receptor (GPCR)
Mol. Mass.:43579.17
Organism:Homo sapiens (Human)
Description:Receptor binding assays were performed using human clone stably expressed in CHO cells
Residue:390
BDBM50199564
NameBDBM50199564
Synonyms:4-dimethylamino-6-methoxy-8-(4-methyl-piperazin-1-yl)-quinoline-2-carboxylic acid (4-morpholin-4-ylphenyl)amide | CHEMBL387545
TypeSmall organic molecule
Emp. Form.C28H36N6O3
Mol. Mass.504.6238
SMILESCOc1cc(N2CCN(C)CC2)c2nc(cc(N(C)C)c2c1)C(=O)Nc1ccc(cc1)N1CCOCC1