Reaction Details
TargetLysosomal protective protein
LigandBDBM50199883
Substrate/Competitorn/a
Meas. Tech.ChEMBL_427758 (CHEMBL917590)
IC50 600±n/a nM
Citation Birkus, GWang, RLiu, XKutty, NMacArthur, HCihlar, TGibbs, CSwaminathan, SLee, WMcDermott, M Cathepsin A is the major hydrolase catalyzing the intracellular hydrolysis of the antiretroviral nucleotide phosphonoamidate prodrugs GS-7340 and GS-9131. Antimicrob Agents Chemother51:543-50 (2007) 
 
Lysosomal protective protein
Name:Lysosomal protective protein
Type:Protein
Mol. Mass.:54465.95
Organism:Homo sapiens (Human)
Description:P10619
Residue:480
BDBM50199883
NameBDBM50199883
Synonyms:3,4‐Dichloroisocoumarin (2) 3,4-dichloro-1H-isochromen-1-one CHEMBL24983 | cid_1609
TypeSmall organic molecule
Emp. Form.C9H4Cl2O2
Mol. Mass.215.033
SMILESClc1oc(=O)c2ccccc2c1Cl