Reaction Details
TargetAdenosine receptor A3
LigandBDBM50199976
Substrate/Competitorn/a
Meas. Tech.ChEMBL_422428 (CHEMBL909840)
Ki 9.5±n/a nM
Citation Cosyn, LPalaniappan, KKKim, SKDuong, HTGao, ZGJacobson, KAVan Calenbergh, S 2-triazole-substituted adenosines: a new class of selective A3 adenosine receptor agonists, partial agonists, and antagonists. J Med Chem49:7373-83 (2006) 
 
Adenosine receptor A3
Name:Adenosine receptor A3
Type:G Protein-Coupled Receptor (GPCR)
Mol. Mass.:36197.32
Organism:Homo sapiens (Human)
Description:P0DMS8
Residue:318
BDBM50199976
NameBDBM50199976
Synonyms:CHEMBL437344 | N6-methyl-2-(4-benzyl-1,2,3-triazol-1-yl)-9-(beta-D-ribofuranosyl)adenine
TypeSmall organic molecule
Emp. Form.C20H22N8O4
Mol. Mass.438.4399
SMILESCNc1nc(nc2n(cnc12)[C@@H]1O[C@H](CO)[C@@H](O)[C@H]1O)-n1cc(Cc2ccccc2)nn1