Reaction Details
TargetAdenosine receptor A3
LigandBDBM50199969
Substrate/Competitorn/a
Meas. Tech.ChEMBL_422428 (CHEMBL909840)
Ki 1.3±n/a nM
Citation Cosyn, LPalaniappan, KKKim, SKDuong, HTGao, ZGJacobson, KAVan Calenbergh, S 2-triazole-substituted adenosines: a new class of selective A3 adenosine receptor agonists, partial agonists, and antagonists. J Med Chem49:7373-83 (2006) 
 
Adenosine receptor A3
Name:Adenosine receptor A3
Type:G Protein-Coupled Receptor (GPCR)
Mol. Mass.:36197.32
Organism:Homo sapiens (Human)
Description:P0DMS8
Residue:318
BDBM50199969
NameBDBM50199969
Synonyms:2-(4-cyclopentylmethyl-1,2,3-triazol-1-yl)-N6-methyl-9-(beta-Dribofuranosyl)adenine | CHEMBL219256
TypeSmall organic molecule
Emp. Form.C19H26N8O4
Mol. Mass.430.4609
SMILESCNc1nc(nc2n(cnc12)[C@@H]1O[C@H](CO)[C@@H](O)[C@H]1O)-n1cc(CC2CCCC2)nn1