Reaction Details
TargetCaspase-8
LigandBDBM50200305
Substrate/Competitorn/a
Meas. Tech.ChEMBL_408845 (CHEMBL909400)
IC50>500000±n/a nM
Citation Kopka, KFaust, AKeul, PWagner, SBreyholz, HJHöltke, CSchober, OSchäfers, MLevkau, B 5-pyrrolidinylsulfonyl isatins as a potential tool for the molecular imaging of caspases in apoptosis. J Med Chem49:6704-15 (2006) 
 
Caspase-8
Name:Caspase-8
Type:Enzyme
Mol. Mass.:55373.89
Organism:Homo sapiens (Human)
Description:Q14790
Residue:479
BDBM50200305
NameBDBM50200305
Synonyms:(S)-1-(4-iodobenzyl)-5-(2-phenoxymethyl-pyrrolidine-1-sulfonyl)isatin CHEMBL384023
TypeSmall organic molecule
Emp. Form.C26H23IN2O5S
Mol. Mass.602.441
SMILESIc1ccc(CN2C(=O)C(=O)c3cc(ccc23)S(=O)(=O)N2CCC[C@H]2COc2ccccc2)cc1