Reaction Details
TargetCaspase-3
LigandBDBM50200305
Substrate/Competitorn/a
Meas. Tech.ChEMBL_408840 (CHEMBL909955)
Ki 1.2±n/a nM
Citation Kopka, KFaust, AKeul, PWagner, SBreyholz, HJHöltke, CSchober, OSchäfers, MLevkau, B 5-pyrrolidinylsulfonyl isatins as a potential tool for the molecular imaging of caspases in apoptosis. J Med Chem49:6704-15 (2006) 
 
Caspase-3
Name:Caspase-3
Type:Hydrolase; heterotetramer of two heterodimers
Mol. Mass.:31607.55
Organism:Homo sapiens (Human)
Description:n/a
Residue:277
BDBM50200305
NameBDBM50200305
Synonyms:(S)-1-(4-iodobenzyl)-5-(2-phenoxymethyl-pyrrolidine-1-sulfonyl)isatin CHEMBL384023
TypeSmall organic molecule
Emp. Form.C26H23IN2O5S
Mol. Mass.602.441
SMILESIc1ccc(CN2C(=O)C(=O)c3cc(ccc23)S(=O)(=O)N2CCC[C@H]2COc2ccccc2)cc1