Reaction Details
TargetCaspase-6
LigandBDBM50200310
Substrate/Competitorn/a
Meas. Tech.ChEMBL_408843 (CHEMBL909967)
IC50>500000±n/a nM
Citation Kopka, KFaust, AKeul, PWagner, SBreyholz, HJHöltke, CSchober, OSchäfers, MLevkau, B 5-pyrrolidinylsulfonyl isatins as a potential tool for the molecular imaging of caspases in apoptosis. J Med Chem49:6704-15 (2006) 
 
Caspase-6
Name:Caspase-6
Type:Enzyme
Mol. Mass.:33312.62
Organism:Homo sapiens (Human)
Description:P55212
Residue:293
BDBM50200310
NameBDBM50200310
Synonyms:(S)-1-(4-(2-(4-methylphenylsulfonyloxy)ethoxy)benzyl)-5-[1-(2-phenoxymethylpyrrolidinyl)sulfonyl]isatin | CHEMBL386510
TypeSmall organic molecule
Emp. Form.C35H34N2O9S2
Mol. Mass.690.782
SMILESCc1ccc(cc1)S(=O)(=O)OCCOc1ccc(CN2C(=O)C(=O)c3cc(ccc23)S(=O)(=O)N2CCC[C@H]2COc2ccccc2)cc1