Reaction Details
TargetCaspase-8
LigandBDBM50200312
Substrate/Competitorn/a
Meas. Tech.ChEMBL_408845 (CHEMBL909400)
IC50>500000±n/a nM
Citation Kopka, KFaust, AKeul, PWagner, SBreyholz, HJHöltke, CSchober, OSchäfers, MLevkau, B 5-pyrrolidinylsulfonyl isatins as a potential tool for the molecular imaging of caspases in apoptosis. J Med Chem49:6704-15 (2006) 
 
Caspase-8
Name:Caspase-8
Type:Enzyme
Mol. Mass.:55373.89
Organism:Homo sapiens (Human)
Description:Q14790
Residue:479
BDBM50200312
NameBDBM50200312
Synonyms:(S)-1-(4-(2-(4-methylphenylsulfonyloxy)ethoxy)benzyl)-5-[1-(2-methoxymethylpyrrolidinyl)sulfonyl]isatin | CHEMBL216071
TypeSmall organic molecule
Emp. Form.C30H32N2O9S2
Mol. Mass.628.713
SMILESCOC[C@@H]1CCCN1S(=O)(=O)c1ccc2N(Cc3ccc(OCCOS(=O)(=O)c4ccc(C)cc4)cc3)C(=O)C(=O)c2c1