Reaction Details
TargetEpidermal growth factor receptor
LigandBDBM50200394
Substrate/Competitorn/a
Meas. Tech.ChEMBL_420193 (CHEMBL856400)
IC50 21±n/a nM
Citation Tari, LWHoffman, IDBensen, DCHunter, MJNix, JNelson, KJMcRee, DESwanson, RV Structural basis for the inhibition of Aurora A kinase by a novel class of high affinity disubstituted pyrimidine inhibitors. Bioorg Med Chem Lett17:688-91 (2007) 
 
Epidermal growth factor receptor
Name:Epidermal growth factor receptor
Type:Receptor Kinase Domain
Mol. Mass.:134279.59
Organism:Homo sapiens (Human)
Description:P00533
Residue:1210
BDBM50200394
NameBDBM50200394
Synonyms:CHEMBL387187 N-3-6-3-trifluoromethyl)phenylamino)pyrimidin-4-ylamino)phenyl)cyclopropanecarboxamide
TypeSmall organic molecule
Emp. Form.C21H18F3N5O
Mol. Mass.413.3957
SMILESFC(F)(F)c1cccc(Nc2cc(Nc3cccc(NC(=O)C4CC4)c3)ncn2)c1