Reaction Details
TargetNociceptin receptor
LigandBDBM50200618
Substrate/Competitorn/a
Meas. Tech.ChEMBL_453746 (CHEMBL885746)
Ki 4±n/a nM
Citation Palin, RBom, AClark, JKEvans, LFeilden, HHoughton, AKJones, PSMontgomery, BWeston, MAWishart, G Synthesis and evaluation of N-3 substituted phenoxypropyl piperidine benzimidazol-2-one analogues as NOP receptor agonists with analgesic and sedative properties. Bioorg Med Chem15:1828-47 (2007) 
 
Nociceptin receptor
Name:Nociceptin receptor
Type:G Protein-Coupled Receptor (GPCR)
Mol. Mass.:40702.87
Organism:Homo sapiens (Human)
Description:P41146
Residue:370
BDBM50200618
NameBDBM50200618
Synonyms:1-methanesulfinylmethyl-3-{1-[3-(5-methoxy-2-methyl-phenoxy)-4-methyl-pentyl]-piperidin-4-yl}-1,3-dihydro-benzimidazol-2-one | CHEMBL391422
TypeSmall organic molecule
Emp. Form.C28H39N3O4S
Mol. Mass.513.692
SMILESCOc1ccc(C)c(OC(CCN2CCC(CC2)n2c3ccccc3n(CS(C)=O)c2=O)C(C)C)c1