Reaction Details
TargetNociceptin receptor
LigandBDBM50200613
Substrate/Competitorn/a
Meas. Tech.ChEMBL_453746 (CHEMBL885746)
Ki 1±n/a nM
Citation Palin, RBom, AClark, JKEvans, LFeilden, HHoughton, AKJones, PSMontgomery, BWeston, MAWishart, G Synthesis and evaluation of N-3 substituted phenoxypropyl piperidine benzimidazol-2-one analogues as NOP receptor agonists with analgesic and sedative properties. Bioorg Med Chem15:1828-47 (2007) 
 
Nociceptin receptor
Name:Nociceptin receptor
Type:G Protein-Coupled Receptor (GPCR)
Mol. Mass.:40702.87
Organism:Homo sapiens (Human)
Description:P41146
Residue:370
BDBM50200613
NameBDBM50200613
Synonyms:1-{1-[3-(5-methoxy-2-methyl-phenoxy)-4-methylpentyl]-piperidin-4-yl}-3-methylsulfanylmethyl-1,3-dihydro-benzimidazol-2-one | CHEMBL240074
TypeSmall organic molecule
Emp. Form.C28H39N3O3S
Mol. Mass.497.693
SMILESCOc1ccc(C)c(OC(CCN2CCC(CC2)n2c3ccccc3n(CSC)c2=O)C(C)C)c1