Reaction Details
TargetNociceptin receptor
LigandBDBM50200597
Substrate/Competitorn/a
Meas. Tech.ChEMBL_453746 (CHEMBL885746)
Ki 2.0±n/a nM
Citation Palin, RBom, AClark, JKEvans, LFeilden, HHoughton, AKJones, PSMontgomery, BWeston, MAWishart, G Synthesis and evaluation of N-3 substituted phenoxypropyl piperidine benzimidazol-2-one analogues as NOP receptor agonists with analgesic and sedative properties. Bioorg Med Chem15:1828-47 (2007) 
 
Nociceptin receptor
Name:Nociceptin receptor
Type:G Protein-Coupled Receptor (GPCR)
Mol. Mass.:40702.87
Organism:Homo sapiens (Human)
Description:P41146
Residue:370
BDBM50200597
NameBDBM50200597
Synonyms:1-(1-(3-(5-methoxy-2-methylphenoxy)-4-methylpentyl)piperidin-4-yl)-1H-benzo[d]imidazol-2(3H)-one CHEMBL427683
TypeSmall organic molecule
Emp. Form.C26H35N3O3
Mol. Mass.437.5744
SMILESCOc1ccc(C)c(OC(CCN2CCC(CC2)n2c3ccccc3[nH]c2=O)C(C)C)c1