Reaction Details
TargetPolyphenol oxidase 2
LigandBDBM20875
Substrate/Competitorn/a
Meas. Tech.ChEMBL_453798 (CHEMBL885799)
IC50 110000±n/a nM
Citation Wang, QQiu, LChen, XRSong, KKShi, YChen, QX Inhibitory effects of phloridzin dihydrate on the activity of mushroom (Agaricus bisporus) tyrosinase. Bioorg Med Chem15:1568-71 (2007) 
 
Polyphenol oxidase 2
Name:Polyphenol oxidase 2
Type:Protein
Mol. Mass.:63923.66
Organism:Agaricus bisporus (Common mushroom)
Description:O42713
Residue:556
BDBM20875
NameBDBM20875
Synonyms:1-(2,4-dihydroxy-6-{[(2S,3R,4S,5S,6R)-3,4,5-trihydroxy-6-(hydroxymethyl)oxan-2-yl]oxy}phenyl)-3-(4-hydroxyphenyl)propan-1-one CHEMBL245067 O-glucoside, 1 | Phlorizin
TypeNatural product
Emp. Form.C21H24O10
Mol. Mass.436.4093
SMILESOC[C@H]1O[C@@H](Oc2cc(O)cc(O)c2C(=O)CCc2ccc(O)cc2)[C@H](O)[C@@H](O)[C@@H]1O