Reaction Details
TargetCaspase-3
LigandBDBM50200931
Substrate/Competitorn/a
Meas. Tech.ChEMBL_423899 (CHEMBL913573)
Ki 1500±n/a nM
Citation Henzing, AJDodson, HReid, JMKaufmann, SHBaxter, RLEarnshaw, WC Synthesis of novel caspase inhibitors for characterization of the active caspase proteome in vitro and in vivo. J Med Chem49:7636-45 (2006) 
 
Caspase-3
Name:Caspase-3
Type:Hydrolase; heterotetramer of two heterodimers
Mol. Mass.:31607.55
Organism:Homo sapiens (Human)
Description:n/a
Residue:277
BDBM50200931
NameBDBM50200931
Synonyms:2,6-dimethyl-benzoic acid (S)-3-{(S)-2-((S)-2-benzyloxycarbonylamino-4-carboxy-butyrylamino)-6-[2-imino-5-((3aS,4S,6aR)-2-oxo-hexahydro-thieno[3,4-d]imidazol-4-yl)-pentanoylamino]-hexanoylamino}-4-carboxy-2-oxo-butylester | CHEMBL415844
TypeSmall organic molecule
Emp. Form.C43H55N7O13S
Mol. Mass.910.001
SMILESCc1cccc(C)c1C(=O)OCC(=O)[C@H](CC(O)=O)NC(=O)[C@H](CCCCNC(=O)C(=N)CCC[C@@H]1SC[C@@H]2NC(=O)N[C@H]12)NC(=O)[C@H](CCC(O)=O)NC(=O)OCc1ccccc1