Reaction Details
TargetThymidine phosphorylase
LigandBDBM50201011
Substrate/Competitorn/a
Meas. Tech.ChEMBL_422808 (CHEMBL856524)
Ki 43500±n/a nM
Citation Allan, ALGladstone, PLPrice, MLHopkins, SAJuarez, JCDoñate, FTernansky, RJShaw, DEGanem, BLi, YWang, WEalick, S Synthesis and evaluation of multisubstrate bicyclic pyrimidine nucleoside inhibitors of human thymidine phosphorylase. J Med Chem49:7807-15 (2006) 
 
Thymidine phosphorylase
Name:Thymidine phosphorylase
Type:Enzyme
Mol. Mass.:49948.87
Organism:Homo sapiens (Human)
Description:The recombinant human thymidine phosphorylase (V79TP) was expressed in V79 Chinese hamster cells (Sigma, T-9319).
Residue:482
BDBM50201011
NameBDBM50201011
Synonyms:2-((2R,3aR,4R,6R,6aR)-4-(hydroxymethyl)-6-(5-methyl-2,4-dioxo-3,4-dihydropyrimidin-1(2H)-yl)-tetrahydrofuro[3,4-d][1,3]dioxol-2-yl)acetic acid | CHEMBL219228
TypeSmall organic molecule
Emp. Form.C13H16N2O8
Mol. Mass.328.2747
SMILESCc1cn([C@@H]2O[C@H](CO)[C@H]3O[C@@H](CC(O)=O)O[C@@H]23)c(=O)[nH]c1=O