Reaction Details
TargetD(1B) dopamine receptor
LigandBDBM50201337
Substrate/Competitorn/a
Meas. Tech.ChEMBL_453888 (CHEMBL885890)
Ki 0.23±n/a nM
Citation Enzensperger, CKilian, SAckermann, MKoch, AKelch, KLehmann, J Dopamine/serotonin receptor ligands. Part 15: Oxygenation of the benz-indolo-azecine LE 300 leads to novel subnanomolar dopamine D1/D5 antagonists. Bioorg Med Chem Lett17:1399-402 (2007) 
 
D(1B) dopamine receptor
Name:D(1B) dopamine receptor
Type:Protein
Mol. Mass.:52943.41
Organism:Homo sapiens (Human)
Description:P21918
Residue:477
BDBM50201337
NameBDBM50201337
Synonyms:11-methoxy-7,14-dimethyl-6,7,8,9,14,15-hexahydro-5Hindolo[3,2-f][3]benzazecine | CHEMBL245764
TypeSmall organic molecule
Emp. Form.C22H26N2O
Mol. Mass.334.4546
SMILESCOc1ccc2n(C)c3Cc4ccccc4CCN(C)CCc3c2c1