Reaction Details
TargetD(1A) dopamine receptor
LigandBDBM50201338
Substrate/Competitorn/a
Meas. Tech.ChEMBL_453884 (CHEMBL885886)
Ki 0.56±n/a nM
Citation Enzensperger, CKilian, SAckermann, MKoch, AKelch, KLehmann, J Dopamine/serotonin receptor ligands. Part 15: Oxygenation of the benz-indolo-azecine LE 300 leads to novel subnanomolar dopamine D1/D5 antagonists. Bioorg Med Chem Lett17:1399-402 (2007) 
 
D(1A) dopamine receptor
Name:D(1A) dopamine receptor
Type:Enzyme
Mol. Mass.:49303.43
Organism:Homo sapiens (Human)
Description:P21728
Residue:446
BDBM50201338
NameBDBM50201338
Synonyms:7-methyl-6,7,8,9,14,15-hexahydro-5H-indolo[3,2-f][3]benzazecin-11-ol | CHEMBL245570
TypeSmall organic molecule
Emp. Form.C20H22N2O
Mol. Mass.306.4015
SMILESCN1CCc2c(Cc3ccccc3CC1)[nH]c1ccc(O)cc21